�������͖���,�ӂ肪��,��\�ҐE��,��\�Ҏ���,�X�֔ԍ�,�Z��,�d�b�ԍ�,FAX�ԍ�,�ϔC�͈̔�,�ϔC��,�ϔC��_�ӂ肪��,�ϔC��_��\�ҐE��,�ϔC��_��\�Ҏ���,�ϔC��_�X�֔ԍ�,�ϔC��_�Z��,�ϔC��_�d�b�ԍ�,�ϔC��_FAX�ԍ�,�����c�Ə�,�ύX�N����,1-(1)����,1-(2)����,1-(3)�����@��,1-(4)��񏈗��@��,1-(5)���,2-(1)�ؐ��Ƌ�,2-(2)�|���Ƌ�,2-(3)����,3-(1)���ŁE���ň��,3-(2)�y���,3-(3)�t�H�[�����,3-(4)������,3-(5)����,3-(6)�o�ŁE���{�E����,4-(1)��Ë@��,4-(2)�H��@��,4-(3)�����w�@��,4-(4)�Y�Ƌ@��,4-(5)�d�C�ʐM�@��,4-(6)���w�v���@��,4-(7)��g�[�@��,4-(8)�~�[�@��,4-(9)���@��,5-(1)�ԗ���,5-(2)�D��,5-(3)�q��@,6-(1)����,6-(2)���ޗp��,6-(3)�^���p��E���W���[�p�i,6-(4)�y��,6-(5)�W�{�E���p�i,7-(1)��Ö�i,7-(2)������i,7-(3)�_�Ɩ�i,7-(4)�H�Ɩ�i,7-(5)�q���ޗ�,7-(6)�f�Íޗ�,8-(1)�Ζ�,8-(2)�ΒY�A�ؒY�A�d,8-(3)�K�X,8-(4)����,9-(1)�|��,9-(2)�Z�����g�E�A�X�t�@���g,9-(3)����,9-(4)����,9-(5)���ޗ�,10-(1)�핞,10-(2)�Q��,10-(3)���̑��̑@�ې��i,11-(1)�x�@�p�i,11-(2)���h�ۈ��p�i,12-(1)�S��,12-(2)���v�A�M����,12-(3)�����A�r���G��,12-(4)�S���A�������i,12-(5)��v,12-(6)�H�i,12-(7)����,12-(8)�Ŕ�,12-(9)�h���A����,12-(10)��c,12-(11)�Ԗ�,12-(12)���G,13-(1)���Y�i,13-(2)�s�p�i,14-(1)�����@��,14-(2)��񏈗��@��,14-(3)�Ƌ�,14-(4)�����w�@��,14-(5)�Y�Ƌ@��,14-(6)�d�C�ʐM�@��,14-(7)�ԗ��D��,14-(8)�Q��,14-(9)���̑�
�A�[�X�T�|�[�g�������,�A�[�X�T�|�[�g,��\�����,�����@�r��,690-0025,���������]�s�������W�W�Q�|�Q,0852-37-2890,0852-37-2892,,,,,,,,,,�o�_�s,,0,0,0,0,0,0,0,0,0,0,0,0,0,0,0,0,0,0,0,0,0,0,0,0,0,0,0,0,0,0,0,0,0,0,0,0,0,0,0,0,0,0,0,0,0,0,0,0,0,0,0,�L,0,�L,0,0,0,0,0,0,0,0,�L,0,�L,0,0,0,0,0,0,0,0,0
������ЃA�[�g,�A�[�g,��\�����,�ɐ��@�F�q,690-0877,���������]�s�t�����U�P�T,0852-22-4321,0852-22-4323,,,,,,,,,,�o�_�s,,0,0,0,0,0,0,0,0,0,0,0,0,0,0,0,0,0,0,�L,0,�L,�L,0,0,0,0,0,0,0,0,0,0,0,0,0,0,0,0,0,0,0,0,0,0,0,0,0,0,�L,0,0,0,0,0,0,0,0,0,�L,0,0,0,0,0,0,�L,�L,0,0,0,�L,0,�L,�L
�������RSK�v���r�W����,�A�[���G�X�P�C�v���r�W����,��\�����,���c�@��,700-0824,���R�����R�s�k����R���꒚�ڂP�|�T,086-201-5067,086-201-5068,,,,,,,,,,,����29�N6��29��,0,0,0,�L,0,0,0,�L,0,0,0,0,0,�L,0,0,0,0,0,0,0,0,0,0,0,0,0,0,0,0,�L,0,0,0,0,0,0,0,0,0,0,0,0,0,0,0,0,0,0,0,0,0,0,0,0,0,0,0,0,0,0,0,0,0,0,0,0,0,0,0,0,0,0,0
�h�g�h�^���@�B�������,�A�C�G�C�`�A�C�E���p���L�J�C,��\������В�,�ٖ�@��,104-0044,�����s�����斾�Β��W�|�P,03-5550-5321,03-5550-5364,,,,,,,,,,,����29�N6��26��,0,0,0,0,0,0,0,0,0,0,0,0,0,0,0,0,0,�L,0,0,0,0,�L,0,0,0,0,0,0,0,0,0,0,0,0,0,0,0,0,0,0,0,0,0,0,0,0,0,0,0,0,0,0,0,0,0,0,0,0,0,0,0,0,0,0,0,0,0,0,0,0,0,0,0
�h�g�h�^���@�B�������,�A�C�G�C�`�A�C�E���p���L�J�C,,,,,,,�S��,���l���c�Ə�,�`���E�V�R�N�G�C�M���E�V��,����,�ځ@�O��,730-0854,�L�����L���s����y�����S�|�P�V,082-532-6075,082-246-2299,,,0,0,0,0,0,0,0,0,0,0,0,0,0,0,0,0,0,�L,0,0,0,0,�L,0,0,0,0,0,0,0,0,0,0,0,0,0,0,0,0,0,0,0,0,0,0,0,0,0,0,0,0,0,0,0,0,0,0,0,0,0,0,0,0,0,0,0,0,0,0,0,0,0,0,0
�h�g�h�v�����g���݊������,�A�C�G�C�`�A�C�v�����g,��\�����,���V�@�S��,135-0061,�����s�]����L�F�O���ڂP�|�P,03-4553-1000,03-4553-1040,,,,,,,,,,,,0,0,0,0,0,0,0,0,0,0,0,0,0,0,0,0,0,�L,0,0,0,0,�L,0,0,0,0,0,0,0,0,0,0,0,0,0,0,0,0,0,0,0,0,0,0,0,0,0,0,0,0,0,0,0,0,0,0,0,0,0,0,0,0,0,0,0,0,0,0,0,0,0,0,0
�A�C�J���������,�A�C�J��,��\�����,�|�c�@�G��,690-0133,���������]�s�����]���X�O�Q�|�T�R,0852-36-5656,0852-36-6070,,,,,,,,,,�o�_�s�A�l�c�s,,0,0,0,0,0,0,0,�L,0,0,0,0,0,0,0,0,0,0,0,0,0,0,0,0,0,0,0,0,0,0,0,0,0,0,0,0,0,0,0,0,0,0,0,0,0,0,0,0,0,0,0,0,0,�L,0,0,0,0,0,0,0,0,0,0,0,0,0,0,0,0,0,0,0,�L
�A�C�R���������,�A�C�R��,��\�����,���� ��,547-0004,���{���s���������ƍ�꒚�ڂU�|�P�X,06-6793-5301,06-6792-2355,,,,,,,,,,,,0,0,0,�L,0,0,0,0,0,0,0,0,0,0,0,0,0,0,�L,0,0,0,0,0,0,0,0,0,0,0,0,0,0,0,0,0,0,0,0,0,0,0,0,0,0,0,0,0,0,0,0,0,0,0,0,0,0,0,0,0,0,0,0,0,0,0,0,0,0,0,0,0,0,0
�A�C�R���������,�A�C�R��,,,,,,,�S��,�L���c�Ə�,�q���V�}�G�C�M���E�V��,����,�牮�@�G��,733-0842,�L�����L���s�������O���ڂP�|�P,082-501-4321,082-501-4301,,,0,0,0,�L,0,0,0,0,0,0,0,0,0,0,0,0,0,0,�L,0,0,0,0,0,0,0,0,0,0,0,0,0,0,0,0,0,0,0,0,0,0,0,0,0,0,0,0,0,0,0,0,0,0,0,0,0,0,0,0,0,0,0,0,0,0,0,0,0,0,0,0,0,0,0
������Ј��X�|�[�c,�A�C�X�|�[�c,��\�����,�F���@�G��,690-0011,���������]�s���Óc���P�V�R�U�|�P,0852-59-5599,0852-59-5660,,,,,,,,,,�v�c�s,����28�N5��16��,0,0,0,0,�L,0,0,0,0,0,0,0,0,0,0,0,0,�L,0,�L,0,0,0,0,0,0,0,�L,�L,0,0,0,0,0,0,0,0,0,0,0,0,0,0,0,0,0,�L,0,�L,�L,0,0,�L,�L,�L,�L,0,0,�L,0,0,0,0,0,0,0,0,0,0,0,0,0,0,0
���m���v�d�@�������,�A�C�`�g�P�C�f���L,������В�,�����@�r�V,456-0054,���m�����É��s�M�c���N�꒚�ڂQ�|�V�O,052-661-5151,052-661-9315,,,,,,,,,,,����30�N4��1��,0,0,0,0,0,0,0,0,0,0,0,0,0,0,0,0,0,�L,0,0,0,0,�L,0,0,0,0,0,0,0,0,0,0,0,0,0,0,0,0,0,0,0,0,0,0,0,0,0,0,0,0,0,0,0,0,0,0,0,0,0,0,0,0,0,0,0,0,0,0,0,0,0,0,0
���m���v�d�@�������,�A�C�`�g�P�C�f���L,,,,,,,�S��,�L���c�Ə�,�q���V�}�G�C�M���E�V��,����,�����@����,733-0012,�L�����L���s���撆�L���񒚖ڂP�R�|�Q�T,082-292-8289,082-294-6253,,,0,0,0,0,0,0,0,0,0,0,0,0,0,0,0,0,0,�L,0,0,0,0,�L,0,0,0,0,0,0,0,0,0,0,0,0,0,0,0,0,0,0,0,0,0,0,0,0,0,0,0,0,0,0,0,0,0,0,0,0,0,0,0,0,0,0,0,0,0,0,0,0,0,0,0
������ЃA�C�e�B�[�v���f���[�X,�A�C�e�B�[�v���f���[�X,��\�����,�����@����,101-0024,�����s���c��_�c�a�򒬂P�|�S�|�V�����r���R�K,03-6423-2500,03-6423-2501,,,,,,,,,,�o�_�s,,0,0,0,�L,0,0,0,0,0,0,0,0,0,0,0,0,0,0,0,0,0,0,0,0,0,0,0,0,0,0,0,0,0,0,0,0,0,0,0,0,0,0,0,0,0,0,0,0,0,0,0,0,0,0,0,0,0,0,0,0,0,0,0,0,0,0,�L,0,0,0,0,0,0,0
������ЃA�C�e�B�[�v���f���[�X,�A�C�e�B�[�v���f���[�X,,,,,,,�S��,�o�_�x�X,�C�Y���V�e��,�x�X��,�����@�G�K,693-0008,�������o�_�s�w�쒬�Q�|�R�|�P�G�C�R�[�w��r���R�K,0853-25-8105,0853-25-8106,,,0,0,0,�L,0,0,0,0,0,0,0,0,0,0,0,0,0,0,0,0,0,0,0,0,0,0,0,0,0,0,0,0,0,0,0,0,0,0,0,0,0,0,0,0,0,0,0,0,0,0,0,0,0,0,0,0,0,0,0,0,0,0,0,0,0,0,�L,0,0,0,0,0,0,0
�h�s���������������,�A�C�e�B�u�b�N,��\�����,���c�@�`,105-0001,�����s�`��Ճm��O���ڂP�|�P,03-6435-8711,03-6435-8720,,,,,,,,,,,,0,0,0,�L,0,0,0,0,0,0,0,0,0,0,0,0,0,0,�L,0,0,0,0,0,0,0,0,0,0,0,0,0,0,0,0,0,0,0,0,0,0,0,0,0,0,0,0,0,0,0,0,0,0,0,0,0,0,0,0,0,0,0,0,0,0,0,�L,0,0,0,�L,0,0,0
�A�C�f�b�N�X���{���g���[�Y�������,�A�C�f�b�N�X���{���g���[�Y,��\������В�,����c�@�[��,168-0063,�����s������a��꒚�ڂQ�Q�|�P�X�@����������c���r���Q�e,03-5301-6700,03-5301-6703,,,,,,,,,,,����30�N8��1��,0,0,0,0,0,0,0,0,0,0,0,0,0,0,0,0,0,0,0,0,0,0,0,0,0,0,0,0,0,0,0,0,�L,0,�L,0,0,0,0,0,0,0,0,0,0,0,0,0,0,0,0,0,0,0,0,0,0,0,0,0,0,0,0,0,0,0,0,0,0,0,0,0,0,0
�h�a�i�k���Ń��[�X�������,�A�C�r�[�W�F�[�G���g�E�V�o���[�X,��\�����,�g�c�@��,105-0001,�����s�`��Ճm��꒚�ڂQ�|�U,03-5253-6760,050-3730-6765,,,,,,,,,,,����29�N4��1��,0,0,0,0,0,0,0,0,0,0,0,0,0,0,0,0,0,0,0,0,0,0,0,0,0,0,0,0,0,0,0,0,0,0,0,0,0,0,0,0,0,0,0,0,0,0,0,0,0,0,0,0,0,0,0,0,0,0,0,0,0,0,0,0,0,�L,�L,�L,�L,�L,�L,0,0,�L
������ЃA�C�s�[�V�X�e��,�A�C�s�[�V�X�e��,��\�����,���ԁ@�h,690-0883,���������]�s�k�c���T�|�P�Q,0852-22-3218,0852-22-3229,,,,,,,,,,,,0,0,0,0,0,0,0,0,0,0,0,0,�L,�L,0,0,0,0,0,0,0,0,0,0,0,0,0,0,0,0,0,0,0,0,0,0,0,0,0,0,0,0,0,0,0,0,0,0,0,0,0,0,0,0,0,0,0,0,0,0,0,0,0,0,0,0,0,0,0,0,0,0,0,0
������ЃA�C�z�\,�A�C�z�[,��\������В�,�����@�Ǘm,442-0848,���m���L��s�������h���U�O,0533-88-5111,0533-88-4510,,,,,,,,,,,,0,0,0,0,0,0,0,0,0,0,0,0,0,0,0,0,0,0,0,0,0,�L,0,0,0,0,0,0,0,0,0,0,0,0,0,0,0,0,0,0,0,0,0,0,0,0,0,0,0,0,0,0,0,0,0,0,0,0,0,0,0,0,0,0,0,0,0,0,0,0,0,0,0,0
������ЃA�C�z�\,�A�C�z�[,,,,,,,�S��,���R�c�Ə�,�I�J���}�G�C�M���E�V��,����,�{�{�@�M�F,700-0972,���R�����R�s�k��㒆��꒚�ڂP�X�|�P�W,086-242-1050,086-242-0212,,,0,0,0,0,0,0,0,0,0,0,0,0,0,0,0,0,0,0,0,0,0,�L,0,0,0,0,0,0,0,0,0,0,0,0,0,0,0,0,0,0,0,0,0,0,0,0,0,0,0,0,0,0,0,0,0,0,0,0,0,0,0,0,0,0,0,0,0,0,0,0,0,0,0,0
�L����ЃA�C�}�b�N�X,�A�C�}�b�N�X,��\�����,�V���@�o�u��,698-0043,�������v�c�s�������C�P�O�T�Q,0856-24-2414,0856-24-2416,,,,,,,,,,,,�L,�L,�L,0,0,0,0,0,0,0,0,0,0,0,0,0,0,0,0,0,0,0,0,0,0,0,0,0,0,0,0,0,0,0,0,0,0,0,0,0,0,0,0,0,0,0,0,0,0,0,0,0,0,0,0,0,0,0,0,0,0,0,0,0,0,0,0,0,0,0,0,0,0,0
�A�C���������,�A�C��,��\�����,�ˁ@�N�G,690-0816,���������]�s�k�˒��S�V,0852-32-1655,0852-28-5660,,,,,,,,,,���]�s,,�L,�L,�L,�L,�L,0,0,0,�L,�L,�L,�L,�L,�L,0,0,�L,�L,�L,�L,0,0,�L,0,0,0,0,0,0,0,0,0,0,0,0,0,0,0,0,0,0,0,0,0,0,0,�L,�L,�L,0,0,0,0,0,0,0,0,0,�L,0,0,0,0,0,0,�L,�L,�L,�L,�L,�L,0,0,0
�����E�������@�C���T�L,�A�C���j�C���T�L,,�ɓ��@�K��,693-0027,�������o�_�s���쒬�񒚖ڂQ�|�V,0853-22-9908,0853-22-9915,,,,,,,,,,�o�_�s,,0,0,0,0,0,0,0,0,0,0,0,0,0,0,0,0,0,0,0,0,0,0,0,0,0,0,0,0,0,0,0,0,0,0,0,0,0,0,0,0,0,0,0,0,0,0,�L,�L,�L,0,�L,0,0,0,�L,�L,0,0,0,0,0,0,0,0,0,0,0,0,0,0,0,0,0,0
������Ј�����,�A�I�C�u���J,��\�����,�r�؁@�S��Y,860-0047,�F�{���F�{�s����t���꒚�ڂW�|�P�S,096-319-0351,0965-45-9245,,,,,,,,,,,,0,0,0,0,0,0,0,0,0,0,0,0,0,0,0,0,0,0,0,0,0,0,0,0,0,0,0,0,0,0,�L,0,0,0,0,0,0,0,0,0,0,0,0,0,0,0,0,0,0,0,0,0,0,0,0,0,0,0,0,0,0,0,0,0,0,0,0,0,0,0,0,0,0,0
������АԔ�,�A�J�I,��\�����,�Ԕ��@��,550-0013,���{���s����V���l���ڂP�R�|�P,06-6532-1265,06-6532-3095,,,,,,,,,,,����28�N2��26��,0,0,0,0,0,0,0,0,0,0,0,0,0,0,0,0,0,0,0,0,0,0,0,�L,0,0,0,0,0,0,0,0,0,0,0,0,0,0,0,0,0,0,0,0,0,0,�L,�L,�L,�L,�L,0,0,0,�L,�L,0,0,0,0,0,0,0,0,0,0,0,0,0,0,0,0,0,0
������АԔ�,�A�J�I,,,,,,,�S��,���c�ƕ�,�I�I�T�J�G�C�M���E�u,�������c�ƕ���,����@�ɏt,550-0013,���{���s����V���l���ڂP�R�|�P,06-6532-4131,06-6536-7456,,,0,0,0,0,0,0,0,0,0,0,0,0,0,0,0,0,0,0,0,0,0,0,0,�L,0,0,0,0,0,0,0,0,0,0,0,0,0,0,0,0,0,0,0,0,0,0,�L,�L,�L,�L,�L,0,0,0,�L,�L,0,0,0,0,0,0,0,0,0,0,0,0,0,0,0,0,0,0
�ԍ����������,�A�J�T�J�C���T�c,��\�����,�ԍ�@����,746-0105,�R��������s�厚�n�_������W�T�S�|�P,0834-66-0001,0834-66-0007,,,,,,,,,,,,0,0,0,0,0,0,0,0,�L,�L,�L,�L,0,�L,0,0,0,0,0,0,0,0,0,0,0,0,0,0,0,0,0,0,0,0,0,0,0,0,0,0,0,0,0,0,0,0,0,0,0,0,0,0,0,0,0,0,0,0,0,0,0,0,0,0,0,0,0,0,0,0,0,0,0,0
�L����Ж��Έ�Ȋ�B�X,�A�J�V�C�J�L�J�C�e��,��\�����,���΁@���M,690-0033,���������]�s��뒬�P�W�O�P�|�S,0852-21-4328,0852-27-7232,,,,,,,,,,,����28�N10��3��,0,0,0,0,0,0,0,0,0,0,0,0,0,0,�L,0,�L,0,0,�L,0,0,0,0,0,0,0,0,0,0,0,0,0,0,0,�L,�L,0,0,0,0,0,0,0,0,0,0,0,0,0,0,0,0,0,0,0,0,0,0,0,0,0,0,0,0,0,0,0,0,0,0,0,0,0
���Ή��������,�A�J�V��,��\�����,���΁@��V,699-0406,���������]�s���������X�z�R�O�R�|�V,0852-66-0016,0852-66-0019,,,,,,,,,,,����28�N7��19��,0,0,0,0,0,0,0,0,0,0,0,0,0,0,0,0,0,0,0,0,0,0,0,0,0,0,0,0,0,0,0,0,0,�L,�L,0,0,0,0,0,0,0,0,0,0,0,0,0,0,0,0,0,0,0,0,0,�L,0,0,0,0,0,0,0,0,0,0,0,0,0,0,0,0,0
�L����ЏH�g������,�A�L���V�W�h�E�V��,��\�����,�H�g�@����,698-0002,�������v�c�s���{�����T�V�|�R,0856-22-1215,0856-22-8579,,,,,,,,,,,,0,0,0,0,0,0,0,0,0,0,0,0,0,0,0,0,0,0,0,0,0,0,0,�L,0,0,0,0,0,0,0,0,0,0,0,0,0,0,0,0,0,0,0,0,0,0,0,0,0,0,0,0,0,0,0,0,0,0,0,0,0,0,0,0,0,0,0,0,0,0,0,�L,0,0
������ЃA�N�e�B�I,�A�N�e�B�I,��\������В�,�����@���Y,103-0027,�����s��������{���O���ڂP�Q�|�Q�@�����r���a���O�V�K,03-6854-1411,03-3276-3221,,,,,,,,,,�l�c�s�E���]�s,,0,0,0,0,0,0,0,0,0,0,0,0,0,0,0,0,0,0,0,0,0,0,0,0,0,0,0,0,0,0,0,0,0,0,0,0,0,0,0,0,0,0,0,0,0,0,0,0,0,0,0,0,0,0,0,0,0,0,0,0,0,0,0,0,0,�L,�L,�L,0,�L,�L,�L,0,�L
������ЃA�N�e�B�I,�A�N�e�B�I,,,,,,,�S��,�����x�X,�`���E�S�N�V�e��,�����x�X��,�l�c�@����,738-0034,�L���������s�s�{�����V���~�R�V�X�|�P,0829-38-3800,0829-38-1684,,,0,0,0,0,0,0,0,0,0,0,0,0,0,0,0,0,0,0,0,0,0,0,0,0,0,0,0,0,0,0,0,0,0,0,0,0,0,0,0,0,0,0,0,0,0,0,0,0,0,0,0,0,0,0,0,0,0,0,0,0,0,0,0,0,0,�L,�L,�L,0,�L,�L,�L,0,�L
������ЃA�N�e��,�A�N�e��,��\�����,�O���@����,106-0045,�����s�`�斃�z�\�Ԉ꒚�ڂW�|�P�P,03-3505-1664,,,,,,,,,,,���]�s,,0,0,0,0,0,0,0,0,0,�L,0,�L,�L,�L,0,0,0,0,0,0,0,0,0,0,0,0,0,0,0,0,0,0,0,0,0,0,0,0,0,0,0,0,0,0,0,0,0,0,0,0,0,0,0,0,0,0,0,0,�L,0,0,0,0,0,0,0,0,0,0,0,0,0,0,0
������ЃA�N�e��,�A�N�e��,,,,,,,�S��,���]�x�X,�}�c�G�V�e��,��\�����,�O���@���v,690-0048,���������]�s���œ��O���ڂP�|�P�R,0852-24-7253,0852-27-8552,,,0,0,0,0,0,0,0,0,0,�L,0,�L,�L,�L,0,0,0,0,0,0,0,0,0,0,0,0,0,0,0,0,0,0,0,0,0,0,0,0,0,0,0,0,0,0,0,0,0,0,0,0,0,0,0,0,0,0,0,0,�L,0,0,0,0,0,0,0,0,0,0,0,0,0,0,0
�ዽ������,�A�S�E���C�W���G��,,�ዽ�@�O��,694-0064,��������c�s��c����c�C�P�W�R�|�U,0854-82-1712,0854-82-1732,,,,,,,,,,,,0,0,0,0,0,0,0,0,0,0,0,0,0,0,0,0,0,0,0,0,0,�L,0,0,0,0,0,0,0,0,0,0,0,0,0,0,0,0,0,0,0,0,0,0,0,0,0,0,0,0,0,0,0,�L,0,0,�L,0,0,0,0,0,0,0,0,0,0,0,0,0,0,0,0,0
����@�ۍH�Ɗ������,�A�T�I�Z���C�R�E�M���E,��\�����,����@��Y,693-0057,�������o�_�s�폼���R�X�R�|�P,0853-23-2525,0853-22-0479,,,,,,,,,,,,0,0,0,0,0,0,0,0,0,0,0,0,0,0,�L,0,0,0,0,0,0,0,0,0,0,0,0,0,0,0,0,0,0,0,0,�L,0,0,0,0,0,0,0,0,0,0,0,�L,0,0,0,0,0,�L,0,0,0,0,0,0,0,0,0,0,0,0,0,0,0,0,0,0,0,0
�L����Ђ�����,�A�T�c,��\�����,��Á@�M��,693-0001,�������o�_�s���s���V�P�V,0853-21-5630,0853-22-6700,,,,,,,,,,,,0,0,0,0,0,�L,�L,0,0,0,0,0,0,0,0,0,0,0,0,0,0,�L,0,0,0,0,0,0,0,0,0,0,0,0,0,0,0,0,0,0,0,0,0,0,0,0,0,0,0,0,0,0,0,�L,0,0,0,0,0,0,0,0,0,0,0,0,0,0,0,0,0,0,0,0
�����G�i�W�[�L�����,�A�T�q�G�i�W�[,��\�����,���΁@�M�G,799-1601,���Q�������s�ÒJ�b�T�S�W�|�P,0898-56-3621,0898-56-2790,,,,,,,,,,,,0,0,0,0,0,0,0,0,0,0,0,0,0,0,0,0,0,0,0,0,0,0,0,0,0,0,0,0,0,0,0,0,0,0,0,0,0,�L,0,0,0,0,0,0,0,0,0,0,0,0,0,0,0,0,0,0,0,0,0,0,0,0,0,0,0,0,0,0,0,0,0,0,0,0
�����q�m�������,�A�T�q�R�E���E,��\������В�,����@�q��,136-0082,�����s�]����V�؏�l���ڂV�|�S�P,03-3522-7161,03-3522-7162,,,,,,,,,,,����28�N6��29��,0,0,0,�L,0,0,0,0,0,0,0,0,0,�L,0,0,0,0,0,0,0,0,0,0,0,�L,0,0,0,0,0,0,0,0,0,0,0,0,0,0,0,0,0,0,0,0,0,0,0,0,0,0,0,0,0,0,0,0,0,0,0,0,0,0,0,0,�L,0,0,0,0,0,0,0
�����q�m�������,�A�T�q�R�E���E,,,,,,,�S��,�R���x�X,���}�O�`�V�e��,�x�X��,���c�@����,754-0021,�R�����R���s���S�������P�P�|�R�P,083-976-0007,083-976-0008,,,0,0,0,�L,0,0,0,0,0,0,0,0,0,�L,0,0,0,0,0,0,0,0,0,0,0,�L,0,0,0,0,0,0,0,0,0,0,0,0,0,0,0,0,0,0,0,0,0,0,0,0,0,0,0,0,0,0,0,0,0,0,0,0,0,0,0,0,�L,0,0,0,0,0,0,0
�A�T�q�e�b�N�X�������,�A�T�q�e�b�N�X,��\�����,�F��@�M�V,166-0004,�����s�����戢���J��O���ڂR�P�|�P�R�@�C�i�o�r���R�O�T����,03-5335-5678,03-5335-5188,,,,,,,,,,,,0,0,0,0,0,0,0,0,0,0,0,0,0,0,0,0,0,0,0,0,0,0,�L,0,0,0,0,0,0,0,0,0,0,0,0,0,0,0,0,0,0,0,0,0,0,0,�L,0,�L,0,0,0,0,0,�L,0,0,0,0,0,0,0,�L,0,0,0,0,0,0,0,0,0,0,0
�A�T�q�v���e�b�N�������,�A�T�q�v���e�b�N,��\�����,���Y�@�m��,658-0024,���Ɍ��_�ˎs����招��l���Q�P,078-431-2981,078-412-3562,,,,,,,,,,,,0,0,0,0,0,0,0,0,0,0,0,0,0,0,0,0,0,0,0,0,0,0,0,0,0,0,0,0,0,0,0,0,0,0,0,0,0,0,0,0,0,0,0,0,0,0,0,0,0,0,0,0,0,0,0,0,0,0,0,0,0,0,0,0,�L,0,0,0,0,0,0,0,0,0
�A�T�q�v���e�b�N�������,�A�T�q�v���e�b�N,,,,,,,�S��,�L���c�Ə�,�q���V�}�G�C�M���E�V��,�c�Ə���,�����@�B��,731-3169,�L�����L���s������攺���O���ڂQ�|�S,082-811-8690,082-811-8693,,,0,0,0,0,0,0,0,0,0,0,0,0,0,0,0,0,0,0,0,0,0,0,0,0,0,0,0,0,0,0,0,0,0,0,0,0,0,0,0,0,0,0,0,0,0,0,0,0,0,0,0,0,0,0,0,0,0,0,0,0,0,0,0,0,�L,0,0,0,0,0,0,0,0,0
�����w���R�v�^�[�������,�A�T�q�w���R�v�^�[�@,��\�����,���c�@�L��,350-0814,��ʌ���z�s�厚���ˎ������U�U�Q�|�P,049-239-3329,049-239-5615,,,,,,,,,,,,0,0,0,0,0,0,0,0,0,0,0,0,0,0,0,�L,0,0,0,0,0,0,0,0,0,0,0,0,0,0,0,0,0,0,0,0,0,0,0,0,0,0,0,0,0,0,�L,0,�L,0,0,0,0,0,0,0,0,0,0,0,0,0,0,0,0,0,0,0,0,0,0,0,0,0
�A�T�q���T�[�`�������,�A�T�q���T�[�`,��\�����,�R�c�@�딎,141-0031,�����s�i��搼�ܔ��c�����ڂR�|�P�R,03-3779-1791,03-3779-1794,,,,,,,,,,,,0,0,0,0,0,0,0,0,0,0,0,0,0,0,0,0,0,0,0,�L,0,0,0,�L,0,0,0,0,�L,0,0,0,0,0,0,0,0,0,0,0,0,0,0,0,0,0,0,0,0,�L,�L,0,0,0,0,0,0,0,0,0,0,0,0,0,0,0,0,0,0,0,0,0,0,0
�A�W�A�q���������,�A�W�A�R�E�\�N,��\�����,����@�I��N,160-0023,�����s�V�h�搼�V�h�Z���ڂP�S�|�P�@�V�h�O���[���^���[�r��,03-5909-4181,03-3348-2248,,,,,,,,,,�o�_�s,����30�N5��14��,0,0,0,�L,0,0,0,0,�L,0,0,0,�L,�L,0,0,0,0,0,0,0,0,0,0,0,0,0,0,0,0,0,0,0,0,0,0,0,0,0,0,0,0,0,0,0,0,0,0,0,0,0,0,0,0,0,0,0,0,0,0,0,0,0,0,0,0,�L,0,0,0,0,0,0,0
�A�W�A�q���������,�A�W�A�R�E�\�N,,,,,,,�S��,�o�_�c�Ə�,�C�Y���G�C�M���E�V��,����,�g���@���j,693-0082,�������o�_�s������ۓ�O���ڂR�|�S,0853-23-7401,0853-23-7402,,,0,0,0,�L,0,0,0,0,�L,0,0,0,�L,�L,0,0,0,0,0,0,0,0,0,0,0,0,0,0,0,0,0,0,0,0,0,0,0,0,0,0,0,0,0,0,0,0,0,0,0,0,0,0,0,0,0,0,0,0,0,0,0,0,0,0,0,0,�L,0,0,0,0,0,0,0
�򒹓����������,�A�X�J�g�N�\�E,��\�����,���@��,252-0154,�_�ސ쌧���͌��s�΋撷�|�Q�X�T�|�P,042-780-5591,042-780-6331,,,,,,,,,,,,0,0,0,0,0,0,0,0,0,0,0,0,0,0,0,0,0,0,0,0,0,0,0,�L,0,0,0,0,0,0,0,0,0,0,0,0,0,0,0,0,0,0,0,0,0,0,0,0,0,0,0,0,0,0,0,0,0,0,0,0,0,0,0,0,0,0,0,0,0,0,0,0,0,0
������ЃA�X�R,�A�X�R,��\�����,�����@�Ď�,441-8021,���m���L���s���͒��P�O�O,0532-34-3821,0532-33-3611,,,,,,,,,,,����28�N2��12��,0,0,0,0,0,0,0,0,0,0,0,0,0,0,�L,0,�L,0,0,0,0,0,0,0,0,0,0,0,0,0,0,�L,�L,0,0,�L,0,0,0,0,0,0,0,0,0,0,0,0,0,0,0,0,0,0,0,0,0,0,0,0,0,0,0,0,0,0,0,0,0,0,0,0,0,0
������ЃA�X�R,�A�X�R,,,,,,,�S��,�Ďq�c�Ə�,���i�S�G�C�M���E�V��,����,���q�@�_�i,689-3547,���挧�Ďq�s���ʒ��P�T�W�|�P�U,0859-27-9780,0859-39-3730,,,0,0,0,0,0,0,0,0,0,0,0,0,0,0,�L,0,�L,0,0,0,0,0,0,0,0,0,0,0,0,0,0,�L,�L,0,0,�L,0,0,0,0,0,0,0,0,0,0,0,0,0,0,0,0,0,0,0,0,0,0,0,0,0,0,0,0,0,0,0,0,0,0,0,0,0,0
������ЃA�X�R�哌,�A�X�R�_�C�g�E,��\�����,�ԏ�@���l,541-0054,���{���s�������{���O���ڂU�|�P�S,06-6282-0310,06-6282-0311,,,,,,,,,,,����28�N4��1��,0,0,0,0,0,0,0,0,0,0,0,0,0,�L,0,0,0,0,0,0,0,0,0,0,0,0,0,0,0,0,0,0,0,0,0,0,0,0,0,0,0,0,0,0,0,0,0,0,0,0,0,0,0,0,0,0,0,0,0,0,0,0,0,0,0,0,0,0,0,0,0,0,0,0
������ЃA�X�R�哌,�A�X�R�_�C�g�E,,,,,,,�S��,�_�ˎx��,�R�E�x�V�V��,�x�В�,�O���@�N,657-0841,���Ɍ��_�ˎs�����ʌܒ��ڂS�|�P�T,078-871-5611,078-871-5541,,,0,0,0,0,0,0,0,0,0,0,0,0,0,�L,0,0,0,0,0,0,0,0,0,0,0,0,0,0,0,0,0,0,0,0,0,0,0,0,0,0,0,0,0,0,0,0,0,0,0,0,0,0,0,0,0,0,0,0,0,0,0,0,0,0,0,0,0,0,0,0,0,0,0,0
�����c�������@�l�����̂Ђ���,�A�X�m�q�J��,������,�����@�b��,690-0025,���������]�s�������V�X�R�|�S,0852-37-2877,0852-37-2892,,,,,,,,,,,����30�N1��11��,0,0,0,0,0,0,0,0,0,0,0,0,0,0,0,0,0,0,0,0,0,0,0,0,0,0,0,0,0,0,0,0,0,0,0,0,0,0,0,0,0,0,0,0,0,0,0,0,0,0,�L,�L,0,0,0,0,0,0,0,0,0,0,0,0,0,0,0,0,0,0,0,0,0,0
������ЃA�X�p�N���G�C�g,�A�X�p�N���G�C�g,��\�����,�g���@�A�d,113-0033,�����s������{���ܒ��ڂQ�T�|�P�U�@�ΐ�r���P�O�e,03-5803-9511,03-5803-9530,,,,,,,,,,,,0,0,0,0,0,0,0,0,0,0,0,0,0,0,0,0,0,0,0,0,0,0,0,0,0,0,�L,�L,0,0,0,0,0,0,0,0,0,0,0,0,0,0,0,0,0,0,0,0,0,0,0,0,0,0,0,0,0,0,0,0,0,0,0,0,0,0,0,0,0,0,0,0,0,0
������Ж������V�X�e��,�A�\�E�W���E�z�E�V�X�e��,��\�����,�뒆�@�G�q,814-0001,�����������s���ǋ�S���l�񒚖ڂS�|�Q�V,092-833-5120,092-833-5125,,,,,,,,,,,,0,0,0,�L,0,0,0,0,0,0,0,0,0,0,0,0,0,0,0,0,0,0,0,0,0,0,0,0,0,0,0,0,0,0,0,0,0,0,0,0,0,0,0,0,0,0,0,0,0,0,0,0,0,0,0,0,0,0,0,0,0,0,0,0,0,0,�L,0,0,0,0,0,0,0
�L����ЃA�^�S�ʐ^��,�A�^�S�V���V���J��,��\�����,�c���@�_�j,691-0001,�������o�_�s���c���W�X�Q�|�T,0853-62-3168,0853-63-8121,,,,,,,,,,,,0,0,0,0,0,0,0,0,0,0,0,0,�L,0,0,0,0,0,0,�L,0,0,0,0,0,0,0,0,0,0,0,0,0,0,�L,0,0,0,0,0,0,0,0,0,0,0,0,0,0,0,0,0,0,0,0,0,0,0,0,0,0,0,0,0,0,0,0,0,0,0,0,0,0,0
���B�Ζ��������,�A�_�`�Z�L��,��\�����,���B�@�^�l,690-0877,���������]�s�t�����T�U�W,0852-28-0771,0852-28-0773,,,,,,,,,,,,0,0,0,0,0,0,0,0,0,0,0,0,0,0,0,0,0,0,0,0,0,0,0,�L,0,0,0,0,0,0,0,0,0,0,0,0,0,�L,0,0,�L,0,0,0,0,0,0,0,0,0,0,0,0,0,0,0,0,0,0,0,0,0,0,0,0,0,0,0,0,0,0,0,0,0
�L����Б����_��,�A�_�`�m�E�G��,��\�����,�����@�m,690-0881,���������]�s�΋����P�W�S,0852-21-1196,0852-21-1358,,,,,,,,,,,,0,0,0,0,0,0,0,0,0,0,0,0,0,0,0,0,0,0,0,0,0,0,0,0,0,0,0,0,0,0,0,0,0,�L,0,0,0,0,0,0,0,0,0,�L,0,0,0,0,0,0,0,0,0,0,0,0,0,0,0,0,�L,�L,�L,0,0,0,0,0,0,0,0,0,0,0
������ЃA�c�^,�A�c�^,��\�����,�M�c�@���i,693-0004,�������o�_�s�n�����P�Q�P�O,0853-22-5530,0853-22-5531,,,,,,,,,,���]�s�A�o�_�s�A��c�s,����28�N2��29��,0,0,0,0,0,0,0,0,0,0,0,0,0,0,0,0,0,0,0,0,0,0,0,0,0,0,0,0,0,�L,0,0,0,0,0,0,0,0,0,0,0,0,0,0,0,0,0,0,0,0,0,0,0,0,0,0,0,0,0,0,0,0,0,0,0,0,0,0,0,0,0,0,0,0
�L����Ђ����Ζ�,�A�c�^�Z�L��,��\�����,�M�c�@�v��,694-0064,��������c�s��c����c���P�P�V�V�|�P�W,0854-82-5661,0854-82-1638,,,,,,,,,,�o�_�s,,0,0,0,0,0,0,0,0,0,0,0,0,0,0,0,0,0,0,0,0,0,0,0,0,0,0,0,0,0,0,0,0,0,0,0,0,0,�L,0,0,0,0,0,0,0,0,0,0,0,0,0,0,0,0,0,0,0,0,0,0,0,0,0,0,0,0,0,0,0,0,0,0,0,0
������ЃA�b�g�A�C,�A�b�g�A�C,��\�����,���c�@�m�l,698-0024,�������v�c�s�w�O���P�V�|�P�@EAGA�@A201,0856-25-7477,0856-25-7478,,,,,,,,,,,,0,0,�L,�L,0,0,0,0,0,0,0,0,0,0,0,0,0,0,�L,0,0,0,0,0,0,0,0,0,0,0,0,0,0,0,0,0,0,0,0,0,0,0,0,0,0,0,0,0,0,0,0,0,0,0,0,0,0,0,0,0,0,0,0,0,0,�L,�L,0,0,0,�L,0,0,0
������ЃA�h�E�Z�C�V��,�A�h�E�Z�C�V��,��\�����,�쌴�@����,699-0105,���������]�s���o�_�����n�P�S�O�O�|�P,0852-67-6110,0852-67-6115,,,,,,,,,,,����29�N9��25��,0,0,0,0,0,0,0,0,0,0,0,0,0,�L,0,0,0,0,0,0,0,0,0,0,0,0,0,0,0,0,0,0,0,0,0,0,0,0,0,0,0,0,0,0,�L,�L,0,0,�L,0,0,0,0,0,0,0,0,0,�L,0,0,0,0,0,0,0,0,0,0,0,0,0,0,�L
������ЃA�h���@���X�g�E�C���t�H�[���C�V�����E�f�U�C��,�A�h���@���X�g�E�C���t�H�[���C�V�����E�f�U�C��,��\�����,�˒J�@�T�F,390-1701,���쌧���{�s����`�R�W�Q�O�|�P,0263-78-8003,0263-78-8213,,,,,,,,,,,����29�N4��1��,0,0,�L,�L,0,0,0,0,0,0,0,0,0,0,0,0,0,0,�L,0,0,0,0,0,0,0,0,0,0,0,0,0,0,0,0,0,0,0,0,0,0,0,0,0,0,0,0,0,0,0,0,0,0,0,0,0,0,0,0,0,0,0,0,0,0,�L,�L,0,0,0,�L,0,0,0
������ЃA�h���@���X�g�E�C���t�H�[���C�V�����E�f�U�C��,�A�h���@���X�g�E�C���t�H�[���C�V�����E�f�U�C��,,,,,,,�S��,�����x��,�`���E�S�N�V�V��,�����x�В�,�R�{�@�q�s,732-0827,�L�����L���s����ג��Q�|�P�S�@�a����ג��r���V�K,082-568-4810,082-568-4818,,,0,0,�L,�L,0,0,0,0,0,0,0,0,0,0,0,0,0,0,�L,0,0,0,0,0,0,0,0,0,0,0,0,0,0,0,0,0,0,0,0,0,0,0,0,0,0,0,0,0,0,0,0,0,0,0,0,0,0,0,0,0,0,0,0,0,0,�L,�L,0,0,0,�L,0,0,0
�L����ЃA�h�ʐ^�X,�A�h�V���V���e��,��\�����,�k�Y�@���M,698-0022,�������v�c�s�L�����P�|�R�U,0856-22-5079,0856-23-3103,,,,,,,,,,,,0,0,0,0,0,0,0,0,0,0,0,0,�L,0,0,0,0,0,0,�L,0,0,0,0,0,0,0,0,0,0,0,0,0,0,0,0,0,0,0,0,0,0,0,0,0,0,0,0,0,0,0,0,0,0,0,0,0,0,0,0,0,0,0,0,0,0,0,0,0,0,0,0,0,0
������ЃA�h�v���b�N�X,�A�h�v���b�N�X,��\�����,�Ό��@���G,730-0847,�L�����L���s����M����꒚�ڂP�|�P�W,082-232-4286,082-232-6573,,,,,,,,,,���]�s,����30�N2��1��,�L,�L,0,0,0,0,0,0,�L,�L,�L,�L,0,�L,0,0,0,0,0,0,0,0,0,0,0,0,0,0,0,0,0,0,0,0,0,0,0,0,0,0,0,0,0,0,0,0,0,0,0,0,�L,0,0,0,0,0,�L,0,�L,0,0,0,0,0,0,0,0,0,0,0,0,0,0,0
������ЃA�h�v���b�N�X,�A�h�v���b�N�X,,,,,,,�S��,�R�A�x��,�T���C���V�V��,�x�В�,���J�@���O,690-0887,���������]�s�a���P�P�P,0852-21-5085,0852-26-0031,,,�L,�L,0,0,0,0,0,0,�L,�L,�L,�L,0,�L,0,0,0,0,0,0,0,0,0,0,0,0,0,0,0,0,0,0,0,0,0,0,0,0,0,0,0,0,0,0,0,0,0,0,0,0,�L,0,0,0,0,0,�L,0,�L,0,0,0,0,0,0,0,0,0,0,0,0,0,0,0
�A�g�~�N�X�������,�A�g�~�N�X,��\�����,�_�ہ@�q�a,174-0041,�����s����M�n�O���ڂX�|�U,03-3969-1552,03-3968-7300,,,,,,,,,,,,0,0,0,�L,0,0,0,0,0,0,0,0,0,0,0,0,0,0,0,0,0,0,0,0,0,0,0,0,0,0,0,0,0,0,0,0,0,0,0,0,0,0,0,0,0,0,0,0,0,0,0,0,0,0,0,0,0,0,0,0,0,0,0,0,0,0,�L,0,0,0,0,0,0,0
�A�}�m�������,�A�}�m,��\�����,�����@��,222-8558,�_�ސ쌧���l�s�`�k��哤�˒��Q�V�T,045-401-1441,045-439-1150,,,,,,,,,,���]�s,,�L,0,�L,�L,0,0,0,0,0,0,0,�L,0,0,0,0,0,�L,0,0,0,0,�L,0,0,0,0,0,0,0,0,0,0,0,0,0,0,0,0,0,0,0,0,0,0,0,0,0,0,0,0,0,0,0,0,0,0,0,0,0,0,0,0,0,0,0,0,0,0,0,0,0,0,0
�A�}�m�������,�A�}�m,,,,,,,�S��,���]�c�Ə�,�}�c�G�G�C�M���E�V��,����,�ē��@�j�T,690-0044,���������]�s�l�T�ؘZ���ڂQ�O�|�W,0852-24-9422,0852-27-1278,,,�L,0,�L,�L,0,0,0,0,0,0,0,�L,0,0,0,0,0,�L,0,0,0,0,�L,0,0,0,0,0,0,0,0,0,0,0,0,0,0,0,0,0,0,0,0,0,0,0,0,0,0,0,0,0,0,0,0,0,0,0,0,0,0,0,0,0,0,0,0,0,0,0,0,0,0,0
������ЃA���j�e�B,�A���j�e�B,��\�����,�R�ˁ@�L�F,221-0863,�_�ސ쌧���l�s�_�ސ��H�򒬂U�W�T,045-371-7676,045-371-7716,,,,,,,,,,,,0,0,0,0,0,0,0,0,0,0,0,0,0,0,0,0,0,0,0,0,0,0,�L,0,0,0,0,0,0,0,0,0,0,0,�L,�L,0,0,0,0,0,0,0,0,0,0,0,0,0,0,0,0,0,0,0,0,0,0,0,0,0,0,�L,0,0,0,0,0,0,0,0,0,0,�L
�r�ؔR���������,�A���L�l�������E,��\�����,�Ώ��@�r�V,690-0025,���������]�s�������V�X�U�|�R�R,0852-37-1216,0852-37-2491,,,,,,,,,,,,0,0,0,0,0,0,0,0,0,0,0,0,0,0,0,0,0,0,0,0,0,0,0,0,0,0,0,0,0,0,0,0,0,0,0,0,0,�L,0,�L,0,0,0,0,0,0,0,0,0,0,0,0,0,0,0,0,0,0,0,0,0,0,0,0,0,0,0,0,0,0,0,0,0,0
�L����Ѝr���A�|���Ζ�,�A���V�}�A�|���Z�L��,��\�����,�����@�Y��,692-0007,�����������s�r�����Q�O�R�|�P,0854-28-8734,0854-28-7287,,,,,,,,,,,,0,0,0,0,0,0,0,0,0,0,0,0,0,0,0,0,0,0,0,0,0,0,0,0,0,0,0,0,0,0,0,0,0,0,0,0,0,�L,0,0,�L,0,0,0,0,0,0,0,0,0,0,0,0,0,0,0,0,0,0,0,0,0,0,0,0,0,0,0,0,0,0,0,0,0
�r�J�������,�A���^�j,��\�����,�r�J�@�N�],733-0833,�L�����L���s���揤�H�Z���^�[�꒚�ڂU�|�S�U,082-277-6888,082-277-1206,,,,,,,,,,,,0,0,0,0,0,0,0,0,0,0,0,0,0,0,0,0,0,0,0,0,0,0,0,0,0,0,0,0,0,0,0,0,0,0,0,0,0,0,0,0,0,0,0,0,0,0,0,0,0,0,0,0,0,0,0,0,0,0,0,0,0,0,�L,0,0,0,0,0,0,0,0,0,0,0
�`�k�r�n�j�R�A�������,�A���\�b�N�T���C��,��\������В�,�i���@�d��,690-0003,���������]�s�������S�V�V�|�P�V,0852-27-6700,0852-27-7933,,,,,,,,,,�o�_�s�A�l�c�s�A�v�c�s,,0,0,0,�L,0,0,�L,0,0,0,0,0,0,0,�L,0,0,0,�L,0,0,0,0,0,0,0,0,0,0,0,0,�L,0,0,0,�L,0,0,0,0,0,0,0,0,0,0,0,0,0,�L,�L,0,0,0,0,0,0,0,0,0,0,0,0,0,0,0,�L,0,0,0,�L,0,0,�L
�A���e���A�E�l�b�g���[�N�X�������,�A���e���A�E�l�b�g���[�N�X,��\�����,���ց@�x���Y,108-0023,�����s�`��ŉY�l���ڂQ�|�W,03-6821-1881,03-6722-5612,,,,,,,,,,,,0,0,0,�L,0,0,0,0,0,0,0,0,0,0,0,0,0,0,�L,0,0,0,0,0,0,0,0,0,0,0,0,0,0,0,0,0,0,0,0,0,0,0,0,0,0,0,0,0,0,0,0,0,0,0,0,0,0,0,0,0,0,0,0,0,0,0,�L,0,0,0,�L,0,0,�L
�����������@�a�������@�r��������,�A���g�X�u�b�N�X�g�A,,�����@�j�V,690-0884,���������]�s��c���V�|�Q�P,0852-21-9418,0852-21-9418,,,,,,,,,,,,0,0,0,0,0,0,0,0,0,0,0,0,0,0,0,0,0,0,0,0,0,0,0,0,0,0,�L,0,0,0,0,0,0,0,0,0,0,0,0,0,0,0,0,0,0,0,0,0,0,0,0,0,0,0,0,0,0,0,0,0,0,0,0,0,0,0,0,0,0,0,0,0,0,0